Target
Histamine H3 receptor
Ligand
BDBM50146843
Substrate
Meas. Tech.
ChEMBL_83641 (CHEMBL695771)
Ki
3.6±n/a nM
Citation
 Zaragoza, FStephensen, HKnudsen, SMPridal, LWulff, BSRimvall, K 1-alkyl-4-acylpiperazines as a new class of imidazole-free histamine H(3) receptor antagonists. J Med Chem 47:2833-8 (2004)  
Target
Name:
Histamine H3 receptor
Synonyms:
G-protein coupled receptor 97 HH3R HRH3 Histamine H3 receptor (H3) Histamine receptor (H3 and H4)
Type:
G Protein-Coupled Receptor (GPCR)
Mol. Mass.:
48691.47
Organism:
Homo sapiens (Human)
Description:
Binding assays were using CHO cells stably expressing hH3R receptors.
Residue:
445
  
Inhibitor
Name:
BDBM50146843
Synonyms:
1-(4-Chloro-phenyl)-4-(4-cyclohexyl-piperazin-1-yl)-butane-1,4-dione; hydrochloride | CHEMBL418969
Type:
Small organic molecule
Emp. Form.:
C20H27ClN2O2
Mol. Mass.:
362.894
SMILES:
Clc1ccc(cc1)C(=O)CCC(=O)N1CCN(CC1)C1CCCCC1
: