Target
6-phosphogluconate dehydrogenase, decarboxylating
Ligand
BDBM50148765
Substrate
Meas. Tech.
ChEMBL_4339 (CHEMBL619158)
Ki
360±n/a nM
Citation
 Dardonville, CRinaldi, EBarrett, MPBrun, RGilbert, IHHanau, S Selective inhibition of Trypanosoma brucei 6-phosphogluconate dehydrogenase by high-energy intermediate and transition-state analogues. J Med Chem 47:3427-37 (2004)  
Target
Name:
6-phosphogluconate dehydrogenase, decarboxylating
Synonyms:
6-phosphogluconate dehydrogenase 6PGD_HUMAN PGDH
Type:
Protein
Mol. Mass.:
53143.42
Organism:
Homo sapiens (Human)
Description:
P52209
Residue:
483
  
Inhibitor
Name:
BDBM50148765
Synonyms:
1-(hydroxyamino)-1-oxo-4-(phosphonooxy)butane-2,3-diyl diacetate CHEMBL114269
Type:
Small organic molecule
Emp. Form.:
C8H14NO10P
Mol. Mass.:
315.1712
SMILES:
CC(=O)O[C@H](COP(O)(O)=O)[C@@H](OC(C)=O)C(=O)NO
: