Target
6-phosphogluconate dehydrogenase, decarboxylating
Ligand
BDBM50148785
Substrate
Meas. Tech.
ChEMBL_4337 (CHEMBL618442)
Ki
40000±n/a nM
Citation
 Dardonville, CRinaldi, EBarrett, MPBrun, RGilbert, IHHanau, S Selective inhibition of Trypanosoma brucei 6-phosphogluconate dehydrogenase by high-energy intermediate and transition-state analogues. J Med Chem 47:3427-37 (2004)  
Target
Name:
6-phosphogluconate dehydrogenase, decarboxylating
Synonyms:
6-phosphogluconate dehydrogenase 6PGD_HUMAN PGDH
Type:
Protein
Mol. Mass.:
53143.42
Organism:
Homo sapiens (Human)
Description:
P52209
Residue:
483
  
Inhibitor
Name:
BDBM50148785
Synonyms:
((R)-2-Acetoxy-3-phosphonooxy-propane-1-sulfinyl)-acetic acid | CHEMBL116916
Type:
Small organic molecule
Emp. Form.:
C7H13O9PS
Mol. Mass.:
304.211
SMILES:
CC(=O)O[C@H](COP(O)(O)=O)CS(=O)CC(O)=O
: