Target
6-phosphogluconate dehydrogenase, decarboxylating
Ligand
BDBM50148770
Substrate
Meas. Tech.
ChEMBL_4339 (CHEMBL619158)
Ki
784000±n/a nM
Citation
 Dardonville, CRinaldi, EBarrett, MPBrun, RGilbert, IHHanau, S Selective inhibition of Trypanosoma brucei 6-phosphogluconate dehydrogenase by high-energy intermediate and transition-state analogues. J Med Chem 47:3427-37 (2004)  
Target
Name:
6-phosphogluconate dehydrogenase, decarboxylating
Synonyms:
6-phosphogluconate dehydrogenase 6PGD_HUMAN PGDH
Type:
Protein
Mol. Mass.:
53143.42
Organism:
Homo sapiens (Human)
Description:
P52209
Residue:
483
  
Inhibitor
Name:
BDBM50148770
Synonyms:
((R)-2-Hydroxy-3-phosphonooxy-propane-1-sulfinyl)-acetic acid | CHEMBL117133
Type:
Small organic molecule
Emp. Form.:
C5H11O8PS
Mol. Mass.:
262.175
SMILES:
O[C@H](COP(O)(O)=O)CS(=O)CC(O)=O
: