Target
Tyrosine-protein phosphatase non-receptor type 1
Ligand
BDBM50133281
Substrate
Meas. Tech.
ChEMBL_162587 (CHEMBL768528)
Kd
800000±n/a nM
Citation
 Erlanson, DAMcDowell, RSO'Brien, T Fragment-based drug discovery. J Med Chem 47:3463-82 (2004)  
Target
Name:
Tyrosine-protein phosphatase non-receptor type 1
Synonyms:
PTN1_HUMAN PTPN1 Protein tyrosine phosphatase-1B (PTP1B) Protein-tyrosine phosphatase 1B (PTP1B) Tyrosine-protein phosphatase non-receptor type 1 (PTP1B)
Type:
Protein phosphatase
Mol. Mass.:
49963.76
Organism:
Homo sapiens (Human)
Description:
Human recombinant GST-fusion PTP1B (1-435).
Residue:
435
  
Inhibitor
Name:
BDBM50133281
Synonyms:
5-(4-Bromo-phenyl)-isoxazole-3-carboxylic acid | CHEMBL115406
Type:
Small organic molecule
Emp. Form.:
C10H6BrNO3
Mol. Mass.:
268.064
SMILES:
OC(=O)c1cc(on1)-c1ccc(Br)cc1
: