Target
Cytochrome P450 2C9
Ligand
BDBM50139812
Substrate
Meas. Tech.
ChEMBL_51556 (CHEMBL661229)
Ki
2200±n/a nM
Citation
 Afzelius, LZamora, IMasimirembwa, CMKarlén, AAndersson, TBMecucci, SBaroni, MCruciani, G Conformer- and alignment-independent model for predicting structurally diverse competitive CYP2C9 inhibitors. J Med Chem 47:907-14 (2004)  
Target
Name:
Cytochrome P450 2C9
Synonyms:
(R)-limonene 6-monooxygenase CP2C9_HUMAN CYP2C9 Cytochrome P450 2C9 (CYP2C9 ) P-450MP P450 PB-1 | S-mephenytoin 4-hydroxylase
Type:
Enzyme
Mol. Mass.:
55636.33
Organism:
Homo sapiens (Human)
Description:
P11712
Residue:
490
  
Inhibitor
Name:
BDBM50139812
Synonyms:
(3R,5R)-fluvastatin (3R,5R,6E)-7-[3-(4-fluorophenyl)-1-isopropyl-1H-indol-2-yl]-3,5-dihydroxyhept-6-enoic acid | CHEMBL170417
Type:
Small organic molecule
Emp. Form.:
C24H26FNO4
Mol. Mass.:
411.4659
SMILES:
CC(C)n1c(\C=C\[C@H](O)C[C@@H](O)CC(O)=O)c(-c2ccc(F)cc2)c2ccccc12
: