Target
Adenylate cyclase type 5
Ligand
BDBM50140057
Substrate
Meas. Tech.
ChEMBL_31714 (CHEMBL645374)
IC50
2800±n/a nM
Citation
 Ye, SRezende, MMDeng, WPHerbert, BDaly, JWJohnson, RAKirk, KL Synthesis of 2',5'-dideoxy-2-fluoroadenosine and 2',5'-dideoxy-2,5'-difluoroadenosine: potent P-site inhibitors of adenylyl cyclase. J Med Chem 47:1207-13 (2004)  
Target
Name:
Adenylate cyclase type 5
Synonyms:
ADCY5_RAT Adcy5 Adenylate cyclase type IX Adenylyl cyclase 5
Type:
PROTEIN
Mol. Mass.:
139188.88
Organism:
Rattus norvegicus
Description:
ChEMBL_31725
Residue:
1262
  
Inhibitor
Name:
BDBM50140057
Synonyms:
2-Hydroxymethyl-5-(6-methylamino-purin-9-yl)-tetrahydro-furan-3,4-diol5-(6-Amino-purin-9-yl)-2-methyl-tetrahydro-furan-3-ol CHEMBL282503
Type:
Small organic molecule
Emp. Form.:
C10H13N5O2
Mol. Mass.:
235.2425
SMILES:
CC1OC(CC1O)n1cnc2c(N)ncnc12
: