Target
Adenylate cyclase type 5
Ligand
BDBM50008363
Substrate
Meas. Tech.
ChEMBL_31714 (CHEMBL645374)
IC50
>100000±n/a nM
Citation
 Ye, SRezende, MMDeng, WPHerbert, BDaly, JWJohnson, RAKirk, KL Synthesis of 2',5'-dideoxy-2-fluoroadenosine and 2',5'-dideoxy-2,5'-difluoroadenosine: potent P-site inhibitors of adenylyl cyclase. J Med Chem 47:1207-13 (2004)  
Target
Name:
Adenylate cyclase type 5
Synonyms:
ADCY5_RAT Adcy5 Adenylate cyclase type IX Adenylyl cyclase 5
Type:
PROTEIN
Mol. Mass.:
139188.88
Organism:
Rattus norvegicus
Description:
ChEMBL_31725
Residue:
1262
  
Inhibitor
Name:
BDBM50008363
Synonyms:
5-(6-Amino-2-fluoro-purin-9-yl)-2-hydroxymethyl-tetrahydro-furan-3-ol | CHEMBL279654
Type:
Small organic molecule
Emp. Form.:
C10H12FN5O3
Mol. Mass.:
269.2324
SMILES:
Nc1nc(F)nc2n(cnc12)C1CC(O)C(CO)O1
: