Target
Carbonic anhydrase 2
Ligand
BDBM26981
Substrate
Meas. Tech.
ChEMBL_302421 (CHEMBL875204)
Ki
26000000±n/a nM
Citation
 Innocenti, AZimmerman, SFerry, JGScozzafava, ASupuran, CT Carbonic anhydrase inhibitors. Inhibition of the beta-class enzyme from the methanoarchaeon Methanobacterium thermoautotrophicum (Cab) with anions. Bioorg Med Chem Lett 14:4563-7 (2004)  
Target
Name:
Carbonic anhydrase 2
Synonyms:
CA-II CAC Carbonate dehydratase II Carbonic anhydrase 2 (CA-II) Carbonic anhydrase C Carbonic anhydrase II (CA-II) Carbonic anhydrase II (hCA II) | Carbonic anhydrase isoenzyme II (hCA II)
Type:
Enzyme
Mol. Mass.:
29250.71
Organism:
Homo sapiens (Human)
Description:
P00918
Residue:
260
  
Inhibitor
Name:
BDBM26981
Synonyms:
CHEMBL1644695 POTASSIUM IODIDE iodide ion
Type:
Ion
Emp. Form.:
I
Mol. Mass.:
126.90502
SMILES:
[I-]
: