Target
5-hydroxytryptamine receptor 6
Ligand
BDBM50130263
Substrate
Meas. Tech.
ChEMBL_302518 (CHEMBL828233)
Ki
0.6±n/a nM
Citation
 Pullagurla, MRWestkaemper, RBGlennon, RA Possible differences in modes of agonist and antagonist binding at human 5-HT6 receptors. Bioorg Med Chem Lett 14:4569-73 (2004)  
Target
Name:
5-hydroxytryptamine receptor 6
Synonyms:
5-HT-6 5-hydroxytryptamine receptor 6 (5-HT-6) 5-hydroxytryptamine receptor 6 (5HT6) HTR6 Serotonin 6 (5-HT6) receptor | Serotonin Receptor 6
Type:
G Protein-Coupled Receptor (GPCR)
Mol. Mass.:
46968.43
Organism:
Homo sapiens (Human)
Description:
P50406
Residue:
440
  
Inhibitor
Name:
BDBM50130263
Synonyms:
4-[3-(2-Dimethylamino-ethyl)-5-methoxy-indole-1-sulfonyl]-phenylamine | CHEMBL94569
Type:
Small organic molecule
Emp. Form.:
C19H23N3O3S
Mol. Mass.:
373.469
SMILES:
COc1ccc2n(cc(CCN(C)C)c2c1)S(=O)(=O)c1ccc(N)cc1
: