Target
5-hydroxytryptamine receptor 6
Ligand
BDBM50150981
Substrate
Meas. Tech.
ChEMBL_302518 (CHEMBL828233)
Ki
2.3±n/a nM
Citation
 Pullagurla, MRWestkaemper, RBGlennon, RA Possible differences in modes of agonist and antagonist binding at human 5-HT6 receptors. Bioorg Med Chem Lett 14:4569-73 (2004)  
Target
Name:
5-hydroxytryptamine receptor 6
Synonyms:
5-HT-6 5-hydroxytryptamine receptor 6 (5-HT-6) 5-hydroxytryptamine receptor 6 (5HT6) HTR6 Serotonin 6 (5-HT6) receptor | Serotonin Receptor 6
Type:
G Protein-Coupled Receptor (GPCR)
Mol. Mass.:
46968.43
Organism:
Homo sapiens (Human)
Description:
P50406
Residue:
440
  
Inhibitor
Name:
BDBM50150981
Synonyms:
CHEMBL365040 | [2-(1-Benzenesulfonyl-5-methoxy-2-propyl-1H-indol-3-yl)-ethyl]-dimethyl-amine
Type:
Small organic molecule
Emp. Form.:
C22H28N2O3S
Mol. Mass.:
400.534
SMILES:
CCCc1c(CCN(C)C)c2cc(OC)ccc2n1S(=O)(=O)c1ccccc1
: