Target
Beta-secretase 1
Ligand
BDBM50152290
Substrate
Meas. Tech.
ChEMBL_302490 (CHEMBL827180)
Ki
0.32±n/a nM
Citation
 Rajamani, RReynolds, CH Modeling the binding affinities of beta-secretase inhibitors: application to subsite specificity. Bioorg Med Chem Lett 14:4843-6 (2004)  
Target
Name:
Beta-secretase 1
Synonyms:
ASP2 Aspartyl protease 2 BACE1 Beta-secretase (BACE) Beta-secretase 1 (BACE 1) Beta-secretase 1 (BACE1) Beta-site amyloid precursor protein cleaving enzyme 1 Memapsin-2 beta-Secretase (BACE-1) | beta-Secretase (BACE1)
Type:
Protein
Mol. Mass.:
55755.10
Organism:
Homo sapiens (Human)
Description:
P56817
Residue:
501
  
Inhibitor
Name:
BDBM50152290
Synonyms:
(2R,5S)-5-[(S)-2-((2R,4S,5S)-5-{(S)-2-[(S)-2-((S)-2-Amino-4-carboxy-butyrylamino)-4-methyl-pentanoylamino]-3-carboxy-propionylamino}-4-hydroxy-2,7-dimethyl-octanoylamino)-3-methyl-butyrylamino]-2-benzyl-4-oxo-octanedioic acid | CHEMBL183214
Type:
Small organic molecule
Emp. Form.:
C45H70N6O15
Mol. Mass.:
935.0685
SMILES:
CC(C)C[C@H](NC(=O)[C@H](CC(O)=O)NC(=O)[C@H](CC(C)C)NC(=O)[C@@H](N)CCC(O)=O)[C@@H](O)C[C@@H](C)C(=O)N[C@@H](C(C)C)C(=O)N[C@@H](CCC(O)=O)C(=O)C[C@@H](Cc1ccccc1)C(O)=O
: