Target
Androgen receptor
Ligand
BDBM50153643
Substrate
Meas. Tech.
ChEMBL_303025 (CHEMBL830413)
Ki
2.5±n/a nM
Citation
 Van Dort, MEJung, YW Synthesis and structure-activity investigation of iodinated arylhydantoins and arylthiohydantoins for development as androgen receptor radioligands. Bioorg Med Chem Lett 14:5285-8 (2004)  
Target
Name:
Androgen receptor
Synonyms:
ANDR_RAT Ar Nr3c4 | androgen
Type:
Enzyme
Mol. Mass.:
98219.08
Organism:
Rattus norvegicus (Rat)
Description:
P15207
Residue:
902
  
Inhibitor
Name:
BDBM50153643
Synonyms:
2-Iodo-4-(3,4,4-trimethyl-5-oxo-2-thioxo-imidazolidin-1-yl)-benzonitrile | CHEMBL362518
Type:
Small organic molecule
Emp. Form.:
C13H12IN3OS
Mol. Mass.:
385.223
SMILES:
CN1C(=S)N(C(=O)C1(C)C)c1ccc(C#N)c(I)c1
: