Target
5-hydroxytryptamine receptor 2A/2B/2C
Ligand
BDBM50155153
Substrate
Meas. Tech.
ChEMBL_306637 (CHEMBL829939)
IC50
>10000±n/a nM
Citation
 Becker, DPFlynn, DLShone, RLGullikson, G Azaadamantane benzamide 5-HT4 agonists: gastrointestinal prokinetic SC-54750. Bioorg Med Chem Lett 14:5509-12 (2004)  
Target
Name:
5-hydroxytryptamine receptor 2A/2B/2C
Synonyms:
Serotonin 2 (5-HT2) receptor
Type:
Mol. Mass.:
Description:
ASSAY_ID of ChEMBL is 306637
Components:
This complex has 3 components.
Component 1
Name:
5-hydroxytryptamine receptor 2B
Synonyms:
5-HT-2B 5-hydroxytryptamine (serotonin) receptor 2B [Homo sapiens] 5-hydroxytryptamine receptor 2C (5HT2C) HTR2B Serotonin 2b (5-HT2b) receptor | Serotonin Receptor 2B
Type:
G Protein-Coupled Receptor (GPCR)
Mol. Mass.:
54312.47
Organism:
Homo sapiens (Human)
Description:
Receptor binding assays were performed using human clone stably expressed in CHO cells.
Residue:
481
  
Component 2
Name:
5-hydroxytryptamine receptor 2C
Synonyms:
5-HT-2C 5-HT2C-INI 5-HTR2C 5-hydroxytryptamine receptor 2C (5-HT-2C) 5HT-1C HTR1C Serotonin (5-HT3) receptor Serotonin Receptor 2C
Type:
G Protein-Coupled Receptor (GPCR)
Mol. Mass.:
51836.79
Organism:
Homo sapiens (Human)
Description:
P28335
Residue:
458
  
Component 3
Name:
5-hydroxytryptamine receptor 2A
Synonyms:
5-HT-2 5-HT2A 5-hydroxytryptamine receptor 2A (5HT-2A) 5HT2A_HUMAN HTR2A | Serotonin receptor 2A
Type:
undefined
Mol. Mass.:
52607.65
Organism:
Homo sapiens (Human)
Description:
P28223
Residue:
471
  
Inhibitor
Name:
BDBM50155153
Synonyms:
4-Amino-N-(1-aza-tricyclo[3.3.1.1*3,7*]dec-4-ylmethyl)-5-chloro-2-methoxy-benzamide | CHEMBL3085015
Type:
Small organic molecule
Emp. Form.:
C18H24ClN3O2
Mol. Mass.:
349.855
SMILES:
COc1cc(N)c(Cl)cc1C(=O)NCC1C2CC3CC1CN(C3)C2
: