Target
Carbonic anhydrase 4
Ligand
BDBM26983
Substrate
Meas. Tech.
ChEMBL_302638 (CHEMBL839929)
Ki
39000000±n/a nM
Citation
 Innocenti, AFirnges, MAAntel, JWurl, MScozzafava, ASupuran, CT Carbonic anhydrase inhibitors: inhibition of the membrane-bound human isozyme IV with anions. Bioorg Med Chem Lett 14:5769-73 (2004)  
Target
Name:
Carbonic anhydrase 4
Synonyms:
CA-IV CAH4_HUMAN Carbonic anhydrase Carbonic anhydrase IV (CA IV)
Type:
Enzyme
Mol. Mass.:
35037.98
Organism:
Homo sapiens (Human)
Description:
P22748
Residue:
312
  
Inhibitor
Name:
BDBM26983
Synonyms:
CHEMBL1644028 Thiocyanate sodium thiocyanate
Type:
Ion
Emp. Form.:
CNS
Mol. Mass.:
58.083
SMILES:
[N-]=C=S
: