Target
Kappa-type opioid receptor
Ligand
BDBM50166721
Substrate
Meas. Tech.
ChEMBL_303392 (CHEMBL839963)
Ki
220±n/a nM
Citation
 Béguin, CRichards, MRWang, YChen, YLiu-Chen, LYMa, ZLee, DYCarlezon, WACohen, BM Synthesis and in vitro pharmacological evaluation of salvinorin A analogues modified at C(2). Bioorg Med Chem Lett 15:2761-5 (2005)  
Target
Name:
Kappa-type opioid receptor
Synonyms:
K-OR-1 Kappa-opioid receptor (KOR) Kappa-type opioid receptor (KOR) OPIATE Kappa OPRK1 kappa opioid receptor (KOR)
Type:
G Protein-Coupled Receptor (GPCR)
Mol. Mass.:
42648.76
Organism:
Homo sapiens (Human)
Description:
P41145
Residue:
380
  
Inhibitor
Name:
BDBM50166721
Synonyms:
(3S,4aR,6S,8R,8aR)-3-Furan-3-yl-6-methoxy-4a,8a-dimethyl-1,5-dioxo-dodecahydro-2-oxa-phenanthrene-8-carboxylic acid methyl ester | CHEMBL426097
Type:
Small organic molecule
Emp. Form.:
C22H28O7
Mol. Mass.:
404.4535
SMILES:
CO[C@H]1C[C@@H](C(=O)OC)[C@]2(C)CCC3C(=O)O[C@@H](C[C@]3(C)C2C1=O)c1ccoc1
: