Target
3-hydroxy-3-methylglutaryl-coenzyme A reductase
Ligand
BDBM22164
Substrate
Meas. Tech.
ChEMBL_305887 (CHEMBL832902)
IC50
6±n/a nM
Citation
 Thilagavathi, RKumar, RAparna, VSobhia, MEGopalakrishnan, BChakraborti, AK Three-dimensional quantitative structure (3-D QSAR) activity relationship studies on imidazolyl and N-pyrrolyl heptenoates as 3-hydroxy-3-methylglutaryl-CoA reductase (HMGR) inhibitors by comparative molecular similarity indices analysis (CoMSIA). Bioorg Med Chem Lett 15:1027-32 (2005)  
Target
Name:
3-hydroxy-3-methylglutaryl-coenzyme A reductase
Synonyms:
3-hydroxy-3-methylglutaryl-coenzyme A (HMG-CoA) reductase HMDH_HUMAN HMG-CoA reductase (HMGR) | HMGCR
Type:
Enzyme
Mol. Mass.:
97477.10
Organism:
Homo sapiens (Human)
Description:
P04035
Residue:
888
  
Inhibitor
Name:
BDBM22164
Synonyms:
(3R,5R)-7-[2-(4-fluorophenyl)-3-phenyl-4-(phenylcarbamoyl)-5-(propan-2-yl)-1H-pyrrol-1-yl]-3,5-dihydroxyheptanoic acid Atorvastatin CI 981 US9353061, Atorvastatina
Type:
Small organic molecule
Emp. Form.:
C33H35FN2O5
Mol. Mass.:
558.6398
SMILES:
CC(C)c1c(C(=O)Nc2ccccc2)c(c(-c2ccc(F)cc2)n1CC[C@@H](O)C[C@@H](O)CC(O)=O)-c1ccccc1
: