Target
Muscarinic acetylcholine receptor M1
Ligand
BDBM50151216
Substrate
Meas. Tech.
ChEMBL_302248 (CHEMBL830264)
Kd
13±n/a nM
Citation
 Tahtaoui, CParrot, IKlotz, PGuillier, FGalzi, JLHibert, MIlien, B Fluorescent pirenzepine derivatives as potential bitopic ligands of the human M1 muscarinic receptor. J Med Chem 47:4300-15 (2004)  
Target
Name:
Muscarinic acetylcholine receptor M1
Synonyms:
ACM1_HUMAN Cholinergic receptor, muscarinic 1 | Cholinergic, muscarinic M1
Type:
Protein
Mol. Mass.:
51442.54
Organism:
Homo sapiens (Human)
Description:
P11229
Residue:
460
  
Inhibitor
Name:
BDBM50151216
Synonyms:
CHEMBL2368391 | difluoro(2-{[(2Z)-1-methyl-5-{2-[(5-{[5-({4-[4-(2-oxo-2-{10-oxo-2,4,9-triazatricyclo[9.4.0.0^{3,8}]pentadeca-1(11),3(8),4,6,12,14-hexaen-2-yl}ethyl)piperazin-1-yl]butyl}carbamoyl)pentyl]carbamoyl}pentyl)carbamoyl]ethyl}-2H-pyrrol-1-ium-2-ylidene]methyl}-5-(thiophen-2-yl)-1H-pyrrol-1-yl)boranuide
Type:
Small organic molecule
Emp. Form.:
C50H61BF2N10O5S
Mol. Mass.:
962.956
SMILES:
F[B-]1(F)n2c(ccc2-c2cccs2)C=C2C=CC(CCC(=O)NCCCCCC(=O)NCCCCCC(=O)NCCCCN3CCN(CC(=O)N4c5ccccc5C(=O)Nc5cccnc45)CC3)=[N+]12
: