Target
Sodium- and chloride-dependent GABA transporter 1
Ligand
BDBM50039251
Substrate
Meas. Tech.
ChEMBL_306677 (CHEMBL830011)
IC50
2760±n/a nM
Citation
 Héja, LKovács, ISzárics, EIncze, MTemesváriné-Major, EDörnyei, GPeredy-Kajtár, MGács-Baitz, ESzántay, CKardos, J Novel secoergoline derivatives inhibit both GABA and glutamate uptake in rat brain homogenates: synthesis, in vitro pharmacology, and modeling. J Med Chem 47:5620-9 (2004)  
Target
Name:
Sodium- and chloride-dependent GABA transporter 1
Synonyms:
GABA transporter Gat-1 SC6A1_RAT Solute carrier family 6 member 1
Type:
PROTEIN
Mol. Mass.:
67006.26
Organism:
Rattus norvegicus
Description:
ChEMBL_1472611
Residue:
599
  
Inhibitor
Name:
BDBM50039251
Synonyms:
(R)-1-(4,4-bis(3-methylthiophen-2-yl)but-3-enyl)piperidine-3-carboxylic acid hydrochloride (R)-1-[4,4-Bis-(3-methyl-thiophen-2-yl)-but-3-enyl]-piperidine-3-carboxylic acid; hydrochloride 1-[4,4-Bis-(3-methyl-4,5-dihydro-thiophen-2-yl)-but-3-enyl]-piperidine-3-carboxylic acid A-70569-1 ABBOTT-70569-1 CHEMBL1027 NNC-05-0328 TIAGABINE | Tiagabine hydrochloride
Type:
Small organic molecule
Emp. Form.:
C20H25NO2S2
Mol. Mass.:
375.548
SMILES:
[#6]-c1ccsc1\[#6](=[#6]/[#6]-[#6]-[#7]-1-[#6]-[#6]-[#6]-[#6@H](-[#6]-1)-[#6](-[#8])=O)-c1sccc1-[#6]
: