Target
Estrogen receptor beta
Ligand
BDBM23451
Substrate
Meas. Tech.
ChEMBL_304774 (CHEMBL828540)
IC50
18.6±n/a nM
Citation
 Zhao, LBrinton, RD Structure-based virtual screening for plant-based ERbeta-selective ligands as potential preventative therapy against age-related neurodegenerative diseases. J Med Chem 48:3463-6 (2005)  
Target
Name:
Estrogen receptor beta
Synonyms:
ER-beta ESR2_HUMAN Estradiol receptor beta (ERβ) Estrogen receptor (ER beta) Estrogen receptor beta (ER beta) NR3A2 estrogen beta
Type:
Protein
Mol. Mass.:
59238.43
Organism:
Homo sapiens (Human)
Description:
Q92731
Residue:
530
  
Inhibitor
Name:
BDBM23451
Synonyms:
5,14-dihydroxy-8,17-dioxatetracyclo[8.7.0.0^{2,7}.0^{11,16}]heptadeca-1(10),2,4,6,11(16),12,14-heptaen-9-one CHEMBL30707 Coumestrol US8552057, 3
Type:
Coumestan
Emp. Form.:
C15H8O5
Mol. Mass.:
268.221
SMILES:
Oc1ccc2c(c1)oc1c2c(=O)oc2cc(O)ccc12
: