Target
Estrogen receptor
Ligand
BDBM23451
Substrate
Meas. Tech.
ChEMBL_304789 (CHEMBL827788)
IC50
75.7±n/a nM
Citation
 Zhao, LBrinton, RD Structure-based virtual screening for plant-based ERbeta-selective ligands as potential preventative therapy against age-related neurodegenerative diseases. J Med Chem 48:3463-6 (2005)  
Target
Name:
Estrogen receptor
Synonyms:
ER ESR ESR1_HUMAN Estrogen receptor Estrogen receptor (ER-alpha) Estrogen receptor alpha (ER) Nuclear receptor subfamily 3 group A member 1
Type:
Protein
Mol. Mass.:
66230.44
Organism:
Homo sapiens (Human)
Description:
P03372
Residue:
595
  
Inhibitor
Name:
BDBM23451
Synonyms:
5,14-dihydroxy-8,17-dioxatetracyclo[8.7.0.0^{2,7}.0^{11,16}]heptadeca-1(10),2,4,6,11(16),12,14-heptaen-9-one CHEMBL30707 Coumestrol US8552057, 3
Type:
Coumestan
Emp. Form.:
C15H8O5
Mol. Mass.:
268.221
SMILES:
Oc1ccc2c(c1)oc1c2c(=O)oc2cc(O)ccc12
: