Target
Solute carrier family 15 member 1
Ligand
BDBM50049707
Substrate
Meas. Tech.
ChEMBL_302952 (CHEMBL841787)
Ki
>30000000±n/a nM
Citation
 Biegel, AGebauer, SHartrodt, BBrandsch, MNeubert, KThondorf, I Three-dimensional quantitative structure-activity relationship analyses of beta-lactam antibiotics and tripeptides as substrates of the mammalian H+/peptide cotransporter PEPT1. J Med Chem 48:4410-9 (2005)  
Target
Name:
Solute carrier family 15 member 1
Synonyms:
Intestinal H(+)/peptide cotransporter Oligopeptide transporter, small intestine isoform Peptide transporter 1 SLC15A1
Type:
PROTEIN
Mol. Mass.:
78818.07
Organism:
Homo sapiens (Human)
Description:
ChEMBL_1488839
Residue:
708
  
Inhibitor
Name:
BDBM50049707
Synonyms:
(6R,7R)-7-{2-(2-Amino-thiazol-4-yl)-2-[(Z)-methoxyimino]-acetylamino}-3-(2-methyl-5,6-dioxo-1,2,5,6-tetrahydro-[1,2,4]triazin-3-ylsulfanylmethyl)-8-oxo-5-thia-1-aza-bicyclo[4.2.0]oct-2-ene-2-carboxylic acid (6R,7R,)-7-(2-(2-aminothiazol-4-yl)-2-(methoxyimino)acetamido)-3-((2-methyl-5,6-dioxo-1,2,5,6-tetrahydro-1,2,4-triazin-3-ylthio)methyl)-8-oxo-5-thia-1-aza-bicyclo[4.2.0]oct-2-ene-2-carboxylic acid 7-[2-(2-Amino-thiazol-4-yl)-2-methoxyimino-acetylamino]-3-(6-hydroxy-2-methyl-5-oxo-2,5-dihydro-[1,2,4]triazin-3-ylsulfanylmethyl)-8-oxo-5-thia-1-aza-bicyclo[4.2.0]oct-2-ene-2-carboxylic acid (Ceftriaxone) CHEMBL161 | ceftriaxone
Type:
Small organic molecule
Emp. Form.:
C18H18N8O7S3
Mol. Mass.:
554.58
SMILES:
CO\N=C(/C(=O)N[C@H]1[C@H]2SCC(CSc3nc(=O)c(=O)[nH]n3C)=C(N2C1=O)C(O)=O)c1csc(N)n1
: