Target
Glutathione reductase, mitochondrial
Ligand
BDBM50170723
Substrate
Meas. Tech.
ChEMBL_302540 (CHEMBL827391)
Ki
192000±n/a nM
Citation
 Meiering, SInhoff, OMies, JVincek, AGarcia, GKramer, BDormeyer, MKrauth-Siegel, RL Inhibitors of Trypanosoma cruzi trypanothione reductase revealed by virtual screening and parallel synthesis. J Med Chem 48:4793-802 (2005)  
Target
Name:
Glutathione reductase, mitochondrial
Synonyms:
GLUR GSHR_HUMAN Glutathione reductase | Glutathione reductase (GR)
Type:
Enzyme
Mol. Mass.:
56271.52
Organism:
Homo sapiens (Human)
Description:
P00390
Residue:
522
  
Inhibitor
Name:
BDBM50170723
Synonyms:
1,1'-Hexamethylene bis(5-(p-chlorophenyl)biguanide) CHLORHEXIDINE N,N'-Bis(4-chlorophenyl)-3,12-diimino-2,4,11,13-tetraazatetradecanediimidamide
Type:
Small organic molecule
Emp. Form.:
C22H30Cl2N10
Mol. Mass.:
505.447
SMILES:
NC(NC(N)=Nc1ccc(Cl)cc1)=NCCCCCCN=C(N)N=C(N)Nc1ccc(Cl)cc1
: