Target
Amiloride-sensitive amine oxidase [copper-containing]
Ligand
BDBM50161143
Substrate
Meas. Tech.
ChEMBL_306517 (CHEMBL828122)
IC50
>1000000±n/a nM
Citation
 Bertini, VBuffoni, FIgnesti, GPicci, NTrombino, SIemma, FAlfei, SPocci, MLucchesini, FDe Munno, A Alkylamino derivatives of 4-aminomethylpyridine as inhibitors of copper-containing amine oxidases. J Med Chem 48:664-70 (2005)  
Target
Name:
Amiloride-sensitive amine oxidase [copper-containing]
Synonyms:
ABP AOC1 Amiloride-binding protein DAO1 Diamine oxidase (DAO) KAO | Kidney amine oxidase
Type:
Protein
Mol. Mass.:
85387.64
Organism:
Homo sapiens (Human)
Description:
P19801
Residue:
751
  
Inhibitor
Name:
BDBM50161143
Synonyms:
(3,5-diethoxypyridin-4-yl)methylamine dihydrochloride | CHEMBL537401
Type:
Small organic molecule
Emp. Form.:
C10H16N2O2
Mol. Mass.:
196.2462
SMILES:
CCOc1cncc(OCC)c1CN
: