Target
Adenylate cyclase type 2
Ligand
BDBM50370620
Substrate
Meas. Tech.
ChEMBL_305824 (CHEMBL829566)
IC50
304±n/a nM
Citation
 Cappellacci, LFranchetti, PPasqualini, MPetrelli, RVita, PLavecchia, ANovellino, ECosta, BMartini, CKlotz, KNGrifantini, M Synthesis, biological evaluation, and molecular modeling of ribose-modified adenosine analogues as adenosine receptor agonists. J Med Chem 48:1550-62 (2005)  
Target
Name:
Adenylate cyclase type 2
Synonyms:
ADCY2_RAT Adcy2 Adenylate cyclase type 2 Adenylyl cyclase 2
Type:
PROTEIN
Mol. Mass.:
123344.82
Organism:
Rattus norvegicus
Description:
ChEMBL_305824
Residue:
1090
  
Inhibitor
Name:
BDBM50370620
Synonyms:
CHEMBL611115
Type:
Small organic molecule
Emp. Form.:
C16H23N5O4
Mol. Mass.:
349.3849
SMILES:
C[C@@]1(O)[C@@H](CO)OC([C@@H]1O)n1cnc2c(NC3CCCC3)ncnc12
: