Target
Histone deacetylase 2b
Ligand
BDBM19130
Substrate
Meas. Tech.
ChEMBL_305568 (CHEMBL827162)
IC50
7±n/a nM
Citation
 Mai, AMassa, SPezzi, RSimeoni, SRotili, DNebbioso, AScognamiglio, AAltucci, LLoidl, PBrosch, G Class II (IIa)-selective histone deacetylase inhibitors. 1. Synthesis and biological evaluation of novel (aryloxopropenyl)pyrrolyl hydroxyamides. J Med Chem 48:3344-53 (2005)  
Target
Name:
Histone deacetylase 2b
Synonyms:
Histone deacetylase HD2
Type:
PROTEIN
Mol. Mass.:
30785.07
Organism:
Zea mays
Description:
ChEMBL_87549
Residue:
286
  
Inhibitor
Name:
BDBM19130
Synonyms:
(2E,4E,6R)-7-[4-(dimethylamino)phenyl]-N-hydroxy-4,6-dimethyl-7-oxohepta-2,4-dienamide TSA | Trichostatin A (TSA)
Type:
Small organic molecule
Emp. Form.:
C17H22N2O3
Mol. Mass.:
302.3682
SMILES:
CC(C=CC(=O)NO)C=C(C)C(=O)c1ccc(cc1)N(C)C
: