Target
DNA polymerase alpha catalytic subunit
Ligand
BDBM50011181
Substrate
Meas. Tech.
ChEMBL_321582 (CHEMBL884690)
pH
7.5±n/a
IC50
>20000±n/a nM
Comments
extracted
Citation
 Schnute, MECudahy, MMBrideau, RJHoma, FLHopkins, TAKnechtel, MLOien, NLPitts, TWPoorman, RAWathen, MWWieber, JL 4-Oxo-4,7-dihydrothieno[2,3-b]pyridines as non-nucleoside inhibitors of human cytomegalovirus and related herpesvirus polymerases. J Med Chem 48:5794-804 (2005)  
Target
Name:
DNA polymerase alpha catalytic subunit
Synonyms:
DNA polymerase (alpha/delta/epsilon) DPOLA_HUMAN POLA1
Type:
PROTEIN
Mol. Mass.:
165895.25
Organism:
Homo sapiens (Human)
Description:
ChEMBL_1365493
Residue:
1462
  
Inhibitor
Name:
BDBM50011181
Synonyms:
(PFA)dihydroxyphosphinecarboxylic acid oxide FOSCARNET Foscarnet (PFA) Phosphono-formic acid(PFA) dihydroxyphosphinecarboxylic acid oxide phosphonoformic acid(PFA)
Type:
Small organic molecule
Emp. Form.:
CH3O5P
Mol. Mass.:
126.0053
SMILES:
OC(=O)P(O)(O)=O
: