Target
DNA polymerase alpha catalytic subunit
Ligand
BDBM50370476
Substrate
Meas. Tech.
ChEMBL_321582 (CHEMBL884690)
pH
7.5±n/a
IC50
13400±n/a nM
Comments
extracted
Citation
 Schnute, MECudahy, MMBrideau, RJHoma, FLHopkins, TAKnechtel, MLOien, NLPitts, TWPoorman, RAWathen, MWWieber, JL 4-Oxo-4,7-dihydrothieno[2,3-b]pyridines as non-nucleoside inhibitors of human cytomegalovirus and related herpesvirus polymerases. J Med Chem 48:5794-804 (2005)  
Target
Name:
DNA polymerase alpha catalytic subunit
Synonyms:
DNA polymerase (alpha/delta/epsilon) DPOLA_HUMAN POLA1
Type:
PROTEIN
Mol. Mass.:
165895.25
Organism:
Homo sapiens (Human)
Description:
ChEMBL_1365493
Residue:
1462
  
Inhibitor
Name:
BDBM50370476
Synonyms:
Combivir | ZIDOVUDINE TRIPHOSPHATE
Type:
Small organic molecule
Emp. Form.:
C10H16N5O13P3
Mol. Mass.:
507.181
SMILES:
Cc1cn([C@H]2C[C@H](N=[N+]=[N-])[C@@H](CO[P@@](O)(=O)O[P@@](O)(=O)OP(O)(O)=O)O2)c(=O)[nH]c1=O
: