Target
Sodium-dependent serotonin transporter
Ligand
BDBM50173717
Substrate
Meas. Tech.
ChEMBL_320797 (CHEMBL884752)
Ki
2.10±n/a nM
Citation
 Mattson, RJCatt, JDDenhart, DJDeskus, JADitta, JLHiggins, MAMarcin, LRSloan, CPBeno, BRGao, QCunningham, MAMattson, GKMolski, TFTaber, MTLodge, NJ Conformationally restricted homotryptamines. 2. Indole cyclopropylmethylamines as selective serotonin reuptake inhibitors. J Med Chem 48:6023-34 (2005)  
Target
Name:
Sodium-dependent serotonin transporter
Synonyms:
5-HT Transporter 5HTT SC6A4_HUMAN SLC6A4 Serotonin transporter (5HTT) Sodium-dependent serotonin transporter (SERT) | Solute carrier family 6 member 4
Type:
Multi-pass membrane protein
Mol. Mass.:
70322.51
Organism:
Homo sapiens (Human)
Description:
P31645
Residue:
630
  
Inhibitor
Name:
BDBM50173717
Synonyms:
((1S,2S)-2-(5-fluoro-1H-indol-3-yl)cyclopropyl)-N,N-dimethylmethanamine CHEMBL198019 | [(1S,2S)-2-(5-Fluoro-1H-indol-3-yl)-cyclopropylmethyl]-dimethyl-amine
Type:
Small organic molecule
Emp. Form.:
C14H17FN2
Mol. Mass.:
232.2966
SMILES:
CN(C)C[C@H]1C[C@@H]1c1c[nH]c2ccc(F)cc12
: