Target
Adenosine receptor A1
Ligand
BDBM82038
Substrate
Meas. Tech.
ChEMBL_321012 (CHEMBL871844)
Ki
>100000±n/a nM
Citation
 Minetti, PTinti, MOCarminati, PCastorina, MDi Cesare, MADi Serio, SGallo, GGhirardi, OGiorgi, FGiorgi, LPiersanti, GBartoccini, FTarzia, G 2-n-Butyl-9-methyl-8-[1,2,3]triazol-2-yl-9H-purin-6-ylamine and analogues as A2A adenosine receptor antagonists. Design, synthesis, and pharmacological characterization. J Med Chem 48:6887-96 (2005)  
Target
Name:
Adenosine receptor A1
Synonyms:
A1 adenosine receptor (hA1) AA1R_HUMAN ADORA1 Adenosine A1-receptor Adenosine receptor A1 (hA1) | Adenosine transporter (AdT)
Type:
G Protein-Coupled Receptor (GPCR)
Mol. Mass.:
36520.92
Organism:
Homo sapiens (Human)
Description:
P30542
Residue:
326
  
Inhibitor
Name:
BDBM82038
Synonyms:
Alloxazine CHEMBL68500 cid_5372720
Type:
Small organic molecule
Emp. Form.:
C10H6N4O2
Mol. Mass.:
214.1802
SMILES:
O=c1[nH]c2nc3ccccc3nc2c(=O)[nH]1
: