Target
Adenosine receptor A2a
Ligand
BDBM82038
Substrate
Meas. Tech.
ChEMBL_321018 (CHEMBL883651)
Ki
935±n/a nM
Citation
 Minetti, PTinti, MOCarminati, PCastorina, MDi Cesare, MADi Serio, SGallo, GGhirardi, OGiorgi, FGiorgi, LPiersanti, GBartoccini, FTarzia, G 2-n-Butyl-9-methyl-8-[1,2,3]triazol-2-yl-9H-purin-6-ylamine and analogues as A2A adenosine receptor antagonists. Design, synthesis, and pharmacological characterization. J Med Chem 48:6887-96 (2005)  
Target
Name:
Adenosine receptor A2a
Synonyms:
A2A adenosine receptor (hA2A) ADENOSINE A2 ADORA2 Adenosine A2A receptor (A2AAR)
Type:
G Protein-Coupled Receptor (GPCR)
Mol. Mass.:
44716.46
Organism:
Homo sapiens (Human)
Description:
P29274
Residue:
412
  
Inhibitor
Name:
BDBM82038
Synonyms:
Alloxazine CHEMBL68500 cid_5372720
Type:
Small organic molecule
Emp. Form.:
C10H6N4O2
Mol. Mass.:
214.1802
SMILES:
O=c1[nH]c2nc3ccccc3nc2c(=O)[nH]1
: