Target
3-oxoacyl-[acyl-carrier-protein] synthase 1
Ligand
BDBM50180119
Substrate
Meas. Tech.
ChEMBL_330089 (CHEMBL863311)
IC50
>1000000±n/a nM
Citation
 Kim, PZhang, YMShenoy, GNguyen, QABoshoff, HIManjunatha, UHGoodwin, MBLonsdale, JPrice, ACMiller, DJDuncan, KWhite, SWRock, COBarry, CEDowd, CS Structure-activity relationships at the 5-position of thiolactomycin: an intact (5R)-isoprene unit is required for activity against the condensing enzymes from Mycobacterium tuberculosis and Escherichia coli. J Med Chem 49:159-71 (2006)  
Target
Name:
3-oxoacyl-[acyl-carrier-protein] synthase 1
Synonyms:
FABB_ECOLI fabC
Type:
PROTEIN
Mol. Mass.:
42605.82
Organism:
Escherichia coli (strain K12)
Description:
ChEMBL_330089
Residue:
406
  
Inhibitor
Name:
BDBM50180119
Synonyms:
5-cyclohexylmethyl-3,5-dimethyl-4-hydroxy-5H-thiophen-2-one | CHEMBL198344
Type:
Small organic molecule
Emp. Form.:
C13H20O2S
Mol. Mass.:
240.362
SMILES:
CC1C(=O)SC(C)(CC2CCCCC2)C1=O
: