Target
5-hydroxytryptamine receptor 4
Ligand
BDBM50181840
Substrate
Meas. Tech.
ChEMBL_332071 (CHEMBL859603)
Ki
0.183000±n/a nM
Citation
 Becker, DPFlynn, DLMoormann, AENosal, RVillamil, CILoeffler, RGullikson, GWMoummi, CYang, DC Pyrrolizidine esters and amides as 5-HT4 receptor agonists and antagonists. J Med Chem 49:1125-39 (2006)  
Target
Name:
5-hydroxytryptamine receptor 4
Synonyms:
5-HT4 5HT4R_CAVPO Serotonin 4 (5-HT4) receptor
Type:
Enzyme Catalytic Domain
Mol. Mass.:
43735.29
Organism:
GUINEA PIG
Description:
5-HT4 HTR4 GUINEA PIG::O70528
Residue:
388
  
Inhibitor
Name:
BDBM50181840
Synonyms:
(1R,7aS)-hexahydro-1H-pyrrolizin-1-ylmethyl 1-Methyl-1Hindole-3-carboxylate | CHEMBL201946
Type:
Small organic molecule
Emp. Form.:
C17H20N2O2
Mol. Mass.:
284.3529
SMILES:
O=C(OC[C@@H]1CCN2CCC[C@@H]12)c1c[nH]c2ccccc12
: