Target
Estrogen receptor
Ligand
BDBM50178323
Substrate
Meas. Tech.
ChEMBL_332769 (CHEMBL865276)
IC50
210±n/a nM
Citation
 Blizzard, TAGude, CMorgan, JDChan, WBirzin, ETMojena, MTudela, CChen, FKnecht, KSu, QKraker, BMosley, RTHolmes, MASharma, NFitzgerald, PMRohrer, SPHammond, ML Androstenediol analogs as ER-beta-selective SERMs. Bioorg Med Chem Lett 16:834-8 (2006)  
Target
Name:
Estrogen receptor
Synonyms:
ER ESR ESR1_HUMAN Estrogen receptor Estrogen receptor (ER-alpha) Estrogen receptor alpha (ER) Nuclear receptor subfamily 3 group A member 1
Type:
Protein
Mol. Mass.:
66230.44
Organism:
Homo sapiens (Human)
Description:
P03372
Residue:
595
  
Inhibitor
Name:
BDBM50178323
Synonyms:
(3S,10R,13S,17S)-10,13-Dimethyl-2,3,4,7,8,9,10,11,12,13,14,15,16,17-tetradecahydro-1H-cyclopenta[a]phenanthrene-3,17-diol | CHEMBL77135
Type:
Small organic molecule
Emp. Form.:
C19H30O2
Mol. Mass.:
290.4403
SMILES:
C[C@]12CCC3C(CC=C4C[C@@H](O)CC[C@]34C)C1CC[C@@H]2O
: