Target
Androgen receptor
Ligand
BDBM50178330
Substrate
Meas. Tech.
ChEMBL_332775 (CHEMBL859226)
IC50
843±n/a nM
Citation
 Blizzard, TAGude, CMorgan, JDChan, WBirzin, ETMojena, MTudela, CChen, FKnecht, KSu, QKraker, BMosley, RTHolmes, MASharma, NFitzgerald, PMRohrer, SPHammond, ML Androstenediol analogs as ER-beta-selective SERMs. Bioorg Med Chem Lett 16:834-8 (2006)  
Target
Name:
Androgen receptor
Synonyms:
ANDR_HUMAN Androgen Receptor Androgen receptor/Baculoviral IAP repeat-containing protein 2 Dihydrotestosterone receptor Nuclear receptor subfamily 3 group C member 4
Type:
Receptor
Mol. Mass.:
99185.27
Organism:
Homo sapiens (Human)
Description:
CHO cells were stably transfected with human AR gene.
Residue:
920
  
Inhibitor
Name:
BDBM50178330
Synonyms:
(3S,10S,13S,17S,E)-13-methyl-10-(prop-1-enyl)-2,3,4,7,8,9,10,11,12,13,14,15,16,17-tetradecahydro-1H-cyclopenta[a]phenanthrene-3,17-diol | CHEMBL202415
Type:
Small organic molecule
Emp. Form.:
C21H32O2
Mol. Mass.:
316.4776
SMILES:
C\C=C\[C@]12CC[C@H](O)CC1=CCC1C3CC[C@H](O)[C@@]3(C)CCC21
: