Target
Estrogen receptor beta
Ligand
BDBM50178332
Substrate
Meas. Tech.
ChEMBL_332770 (CHEMBL859108)
IC50
230±n/a nM
Citation
 Blizzard, TAGude, CMorgan, JDChan, WBirzin, ETMojena, MTudela, CChen, FKnecht, KSu, QKraker, BMosley, RTHolmes, MASharma, NFitzgerald, PMRohrer, SPHammond, ML Androstenediol analogs as ER-beta-selective SERMs. Bioorg Med Chem Lett 16:834-8 (2006)  
Target
Name:
Estrogen receptor beta
Synonyms:
ER-beta ESR2_HUMAN Estradiol receptor beta (ERβ) Estrogen receptor (ER beta) Estrogen receptor beta (ER beta) NR3A2 estrogen beta
Type:
Protein
Mol. Mass.:
59238.43
Organism:
Homo sapiens (Human)
Description:
Q92731
Residue:
530
  
Inhibitor
Name:
BDBM50178332
Synonyms:
(3S,10S,13S,17S)-3,17-dihydroxy-13-methyl-2,3,4,7,8,9,10,11,12,13,14,15,16,17-tetradecahydro-1H-cyclopenta[a]phenanthrene-10-carbaldehyde | CHEMBL380978
Type:
Small organic molecule
Emp. Form.:
C19H28O3
Mol. Mass.:
304.4238
SMILES:
C[C@]12CCC3C(CC=C4C[C@@H](O)CC[C@]34C=O)C1CC[C@@H]2O
: