Target
Integrase
Ligand
BDBM50184621
Substrate
Meas. Tech.
ChEMBL_355503 (CHEMBL871193)
IC50
>300000±n/a nM
Citation
 Walker, MAJohnson, TMa, ZBanville, JRemillard, RKim, OZhang, YStaab, AWong, HTorri, ASamanta, HLin, ZDeminie, CTerry, BKrystal, MMeanwell, N Triketoacid inhibitors of HIV-integrase: a new chemotype useful for probing the integrase pharmacophore. Bioorg Med Chem Lett 16:2920-4 (2006)  
Target
Name:
Integrase
Synonyms:
Human immunodeficiency virus type 1 integrase
Type:
PROTEIN
Mol. Mass.:
32231.48
Organism:
Human immunodeficiency virus 1
Description:
ChEMBL_90865
Residue:
288
  
Inhibitor
Name:
BDBM50184621
Synonyms:
2,4,6-trioxo-6-(pyridin-3-yl)hexanoic acid | CHEMBL210863
Type:
Small organic molecule
Emp. Form.:
C11H9NO5
Mol. Mass.:
235.1929
SMILES:
OC(=O)C(=O)CC(=O)CC(=O)c1cccnc1
: