Target
Integrase
Ligand
BDBM107693
Substrate
Meas. Tech.
ChEMBL_355513 (CHEMBL863032)
IC50
80±n/a nM
Citation
 Walker, MAJohnson, TMa, ZBanville, JRemillard, RKim, OZhang, YStaab, AWong, HTorri, ASamanta, HLin, ZDeminie, CTerry, BKrystal, MMeanwell, N Triketoacid inhibitors of HIV-integrase: a new chemotype useful for probing the integrase pharmacophore. Bioorg Med Chem Lett 16:2920-4 (2006)  
Target
Name:
Integrase
Synonyms:
Human immunodeficiency virus type 1 integrase
Type:
PROTEIN
Mol. Mass.:
32231.48
Organism:
Human immunodeficiency virus 1
Description:
ChEMBL_90865
Residue:
288
  
Inhibitor
Name:
BDBM107693
Synonyms:
(2Z)-4-(5-chloro-1H-indol-3-yl)-2-hydroxy-4-oxobut-2- enoic acid (Compound 19) | CHEMBL108760
Type:
Small organic molecule
Emp. Form.:
C12H8ClNO4
Mol. Mass.:
265.649
SMILES:
OC(=O)C(=O)CC(=O)c1c[nH]c2ccc(Cl)cc12
: