Target
Proteasome subunit beta type-2
Ligand
BDBM50185156
Substrate
Meas. Tech.
ChEMBL_359170 (CHEMBL869329)
IC50
20±n/a nM
Citation
 Marastoni, MBaldisserotto, ATrapella, CGavioli, RTomatis, R P3 and P4 position analysis of vinyl ester pseudopeptide proteasome inhibitors. Bioorg Med Chem Lett 16:3125-30 (2006)  
Target
Name:
Proteasome subunit beta type-2
Synonyms:
20S proteasome PSMB2 | Proteasome Macropain subunit
Type:
PROTEIN
Mol. Mass.:
22837.53
Organism:
Homo sapiens (Human)
Description:
ChEMBL_1294233
Residue:
201
  
Inhibitor
Name:
BDBM50185156
Synonyms:
CHEMBL210439 | Hmb-Val-Gln-Leu-VE
Type:
Small organic molecule
Emp. Form.:
C28H42N4O7
Mol. Mass.:
546.6557
SMILES:
CCOC(=O)\C=C\[C@H](CC(C)C)NC(=O)[C@H](CCC(N)=O)NC(=O)[C@@H](NC(=O)c1cccc(O)c1C)C(C)C
: