Target
3-oxoacyl-acyl-carrier protein reductase
Ligand
BDBM50049394
Substrate
Meas. Tech.
ChEMBL_361105 (CHEMBL859171)
IC50
70000±n/a nM
Citation
 Tasdemir, DLack, GBrun, RRüedi, PScapozza, LPerozzo, R Inhibition of Plasmodium falciparum fatty acid biosynthesis: evaluation of FabG, FabZ, and FabI as drug targets for flavonoids. J Med Chem 49:3345-53 (2006)  
Target
Name:
3-oxoacyl-acyl-carrier protein reductase
Synonyms:
Type:
PROTEIN
Mol. Mass.:
33333.53
Organism:
Plasmodium falciparum
Description:
ChEMBL_675156
Residue:
301
  
Inhibitor
Name:
BDBM50049394
Synonyms:
5,4'-Dihydroxy-6,7-dimethoxyflavone 5-hydroxy-2-(4-hydroxyphenyl)-6,7-dimethoxy-4H-chromen-4-one Cirsimaritin cirsimartin
Type:
Small organic molecule
Emp. Form.:
C17H14O6
Mol. Mass.:
314.2895
SMILES:
COc1cc2oc(cc(=O)c2c(O)c1OC)-c1ccc(O)cc1
: