Target
3-oxoacyl-acyl-carrier protein reductase
Ligand
BDBM50049391
Substrate
Meas. Tech.
ChEMBL_361105 (CHEMBL859171)
IC50
100000±n/a nM
Citation
 Tasdemir, DLack, GBrun, RRüedi, PScapozza, LPerozzo, R Inhibition of Plasmodium falciparum fatty acid biosynthesis: evaluation of FabG, FabZ, and FabI as drug targets for flavonoids. J Med Chem 49:3345-53 (2006)  
Target
Name:
3-oxoacyl-acyl-carrier protein reductase
Synonyms:
Type:
PROTEIN
Mol. Mass.:
33333.53
Organism:
Plasmodium falciparum
Description:
ChEMBL_675156
Residue:
301
  
Inhibitor
Name:
BDBM50049391
Synonyms:
3,5,7-Trihydroxyflavone 3,5,7-trihydroxy-2-phenyl-4H-benzopyran-4-one CHEMBL309490 Galangin (15) cid_5281616 | norizalpinin
Type:
Small organic molecule
Emp. Form.:
C15H10O5
Mol. Mass.:
270.2369
SMILES:
Oc1cc(O)c2c(c1)oc(-c1ccccc1)c(O)c2=O
: