Target
Endoplasmin
Ligand
BDBM50366480
Substrate
Meas. Tech.
ChEMBL_365492 (CHEMBL867908)
EC50
19000±n/a nM
Citation
 Ge, JNormant, EPorter, JRAli, JADembski, MSGao, YGeorges, ATGrenier, LPak, RHPatterson, JSydor, JRTibbitts, TTTong, JKAdams, JPalombella, VJ Design, synthesis, and biological evaluation of hydroquinone derivatives of 17-amino-17-demethoxygeldanamycin as potent, water-soluble inhibitors of Hsp90. J Med Chem 49:4606-15 (2006)  
Target
Name:
Endoplasmin
Synonyms:
ENPL_CANLF HSP90B1 TRA1
Type:
PROTEIN
Mol. Mass.:
92464.42
Organism:
Canis familiaris
Description:
ChEMBL_1478277
Residue:
804
  
Inhibitor
Name:
BDBM50366480
Synonyms:
ADENOSINE TRIPHOSPHATE | ATP
Type:
Small organic molecule
Emp. Form.:
C10H16N5O13P3
Mol. Mass.:
507.181
SMILES:
Nc1ncnc2n(cnc12)[C@@H]1O[C@H](CO[P@](O)(=O)O[P@@](O)(=O)OP(O)(O)=O)[C@@H](O)[C@H]1O
: