Target
2-dehydropantoate 2-reductase
Ligand
BDBM50366480
Substrate
Meas. Tech.
ChEMBL_382750 (CHEMBL854529)
Ki
610000±n/a nM
Citation
 Ciulli, AWilliams, GSmith, AGBlundell, TLAbell, C Probing hot spots at protein-ligand binding sites: a fragment-based approach using biophysical methods. J Med Chem 49:4992-5000 (2006)  
Target
Name:
2-dehydropantoate 2-reductase
Synonyms:
Ketopantoate reductase apbA | panE
Type:
PROTEIN
Mol. Mass.:
33866.35
Organism:
Escherichia coli (strain K12)
Description:
ChEMBL_382751
Residue:
303
  
Inhibitor
Name:
BDBM50366480
Synonyms:
ADENOSINE TRIPHOSPHATE | ATP
Type:
Small organic molecule
Emp. Form.:
C10H16N5O13P3
Mol. Mass.:
507.181
SMILES:
Nc1ncnc2n(cnc12)[C@@H]1O[C@H](CO[P@](O)(=O)O[P@@](O)(=O)OP(O)(O)=O)[C@@H](O)[C@H]1O
: