Target
Mu-type opioid receptor
Ligand
BDBM50199898
Substrate
Meas. Tech.
ChEMBL_422443 (CHEMBL909317)
Ki
73±n/a nM
Citation
 Le Bourdonnec, BGoodman, AJMichaut, MYe, HFGraczyk, TMBelanger, SHerbertz, TYap, GPDeHaven, RNDolle, RE Elucidation of the bioactive conformation of the N-substituted trans-3,4-dimethyl-4-(3-hydroxyphenyl)piperidine class of mu-opioid receptor antagonists. J Med Chem 49:7278-89 (2006)  
Target
Name:
Mu-type opioid receptor
Synonyms:
M-OR-1 MOR-1 MUOR1 Mu opiate receptor OPRM1 hMOP | mu-type opioid receptor isoform MOR-1
Type:
G Protein-Coupled Receptor (GPCR)
Mol. Mass.:
44789.51
Organism:
Homo sapiens (Human)
Description:
P35372
Residue:
400
  
Inhibitor
Name:
BDBM50199898
Synonyms:
3-((1R,2R,7R,9-alpha-S)-1,2-dimethyl-7-phenyl-octahydro-1H-quinolizin-2-yl)phenol | CHEMBL385392
Type:
Small organic molecule
Emp. Form.:
C23H29NO
Mol. Mass.:
335.4825
SMILES:
C[C@H]1[C@@H]2CC[C@@H](CN2CC[C@@]1(C)c1cccc(O)c1)c1ccccc1
: