Target
Sex hormone-binding globulin
Ligand
BDBM8885
Substrate
Meas. Tech.
ChEMBL_422532 (CHEMBL911029)
IC50
14±n/a nM
Citation
 Cherkasov, ABan, FLi, YFallahi, MHammond, GL Progressive docking: a hybrid QSAR/docking approach for accelerating in silico high throughput screening. J Med Chem 49:7466-78 (2006)  
Target
Name:
Sex hormone-binding globulin
Synonyms:
SHBG Testis-specific androgen-binding protein
Type:
PROTEIN
Mol. Mass.:
43780.19
Organism:
Homo sapiens (Human)
Description:
ChEMBL_466706
Residue:
402
  
Inhibitor
Name:
BDBM8885
Synonyms:
(1S,2R,10R,11S,14S,15S)-14-hydroxy-2,15-dimethyltetracyclo[8.7.0.0^{2,7}.0^{11,15}]heptadec-6-en-5-one Testosterone US9682960, Testosterone
Type:
Steroid
Emp. Form.:
C19H28O2
Mol. Mass.:
288.4244
SMILES:
[H][C@@]12CC[C@H](O)[C@@]1(C)CC[C@@]1([H])[C@@]2([H])CCC2=CC(=O)CC[C@]12C
: