Target
Sodium-dependent noradrenaline transporter
Ligand
BDBM50062912
Substrate
Meas. Tech.
ChEMBL_423471 (CHEMBL911128)
Ki
660±n/a nM
Citation
 Froimowitz, MGu, YDakin, LANagafuji, PMKelley, CJParrish, DDeschamps, JRJanowsky, A Slow-onset, long-duration, alkyl analogues of methylphenidate with enhanced selectivity for the dopamine transporter. J Med Chem 50:219-32 (2007)  
Target
Name:
Sodium-dependent noradrenaline transporter
Synonyms:
Monoamine transporter NET Noradrenaline Transporter (NET) Norepinephrine transporter protein (NET) SLC6A2 Sodium-dependent noradrenaline transporter (NET) | Solute carrier family 6 member 2
Type:
Multi-pass membrane protein
Mol. Mass.:
69337.72
Organism:
Homo sapiens (Human)
Description:
P23975
Residue:
617
  
Inhibitor
Name:
BDBM50062912
Synonyms:
CHEMBL796 alpha-phenyl-2-piperidineacetic acid methyl ester methyl alpha-phenyl-alpha-2-piperidinylacetate methyl phenyl(piperidin-2-yl)acetate | methylphenidan
Type:
Small organic molecule
Emp. Form.:
C14H19NO2
Mol. Mass.:
233.3062
SMILES:
COC(=O)C(C1CCCCN1)c1ccccc1
: