Target
Enoyl-acyl-carrier protein reductase
Ligand
BDBM8726
Substrate
Meas. Tech.
ChEMBL_425622 (CHEMBL912562)
Ki
0.2806±n/a nM
Citation
 Sharma, SKParasuraman, PKumar, GSurolia, NSurolia, A Green tea catechins potentiate triclosan binding to enoyl-ACP reductase from Plasmodium falciparum (PfENR). J Med Chem 50:765-75 (2007)  
Target
Name:
Enoyl-acyl-carrier protein reductase
Synonyms:
Type:
PROTEIN
Mol. Mass.:
49770.86
Organism:
Plasmodium falciparum
Description:
ChEMBL_795989
Residue:
432
  
Inhibitor
Name:
BDBM8726
Synonyms:
5-chloro-2-(2,4-dichlorophenoxy)phenol TCL US20230414581, Compound 35
Type:
Small organic molecule
Emp. Form.:
C12H7Cl3O2
Mol. Mass.:
289.542
SMILES:
Oc1cc(Cl)ccc1Oc1ccc(Cl)cc1Cl
: