Target
Cystathionine beta-lyase MetC
Ligand
BDBM50370864
Substrate
Meas. Tech.
ChEMBL_425863 (CHEMBL856866)
IC50
6900±n/a nM
Citation
 Ejim, LJBlanchard, JEKoteva, KPSumerfield, RElowe, NHChechetto, JDBrown, EDJunop, MSWright, GD Inhibitors of bacterial cystathionine beta-lyase: leads for new antimicrobial agents and probes of enzyme structure and function. J Med Chem 50:755-64 (2007)  
Target
Name:
Cystathionine beta-lyase MetC
Synonyms:
Beta-cystathionase Cysteine lyase metC
Type:
PROTEIN
Mol. Mass.:
43211.38
Organism:
Escherichia coli K-12
Description:
ChEMBL_425863
Residue:
395
  
Inhibitor
Name:
BDBM50370864
Synonyms:
CHEMBL451558
Type:
Small organic molecule
Emp. Form.:
C4H5ClN2O2S2
Mol. Mass.:
212.678
SMILES:
NNS(=O)(=O)c1ccc(Cl)s1
: