Target
Vasopressin V1b receptor
Ligand
BDBM50205305
Substrate
Meas. Tech.
ChEMBL_425924 (CHEMBL907379)
Ki
0.13±n/a nM
Citation
 Pena, AMurat, BTrueba, MVentura, MAWo, NCSzeto, HHCheng, LLStoev, SGuillon, GManning, M Design and synthesis of the first selective agonists for the rat vasopressin V(1b) receptor: based on modifications of deamino-[Cys1]arginine vasopressin at positions 4 and 8. J Med Chem 50:835-47 (2007)  
Target
Name:
Vasopressin V1b receptor
Synonyms:
Avpr1b VASOPRESSIN V1B Vasopressin receptor
Type:
Enzyme Catalytic Domain
Mol. Mass.:
47104.48
Organism:
RAT
Description:
VASOPRESSIN V1B AVPR1B RAT::P48974
Residue:
425
  
Inhibitor
Name:
BDBM50205305
Synonyms:
CHEMBL375324 | d[Arg4]AVP
Type:
Small organic molecule
Emp. Form.:
C47H68N16O11S2
Mol. Mass.:
1097.273
SMILES:
[#7]-[#6](=O)-[#6]-[#7]-[#6](=O)-[#6@H](-[#6]-[#6]-[#6]\[#7]=[#6](\[#7])-[#7])-[#7]-[#6](=O)-[#6@@H]-1-[#6]-[#6]-[#6]-[#7]-1-[#6](=O)-[#6@@H]-1-[#6]-[#16]-[#16]-[#6]-[#6]-[#6](=O)-[#7]-[#6@@H](-[#6]-c2ccc(-[#8])cc2)-[#6](=O)-[#7]-[#6@@H](-[#6]-c2ccccc2)-[#6](=O)-[#7]-[#6@@H](-[#6]-[#6]-[#6]-[#7]-[#6](-[#7])=[#7])-[#6](=O)-[#7]-[#6@@H](-[#6]-[#6](-[#7])=O)-[#6](=O)-[#7]-1
: