Target
L-selectin
Ligand
BDBM50205375
Substrate
Meas. Tech.
ChEMBL_428319 (CHEMBL917097)
IC50
2300±n/a nM
Citation
 Kranich, RBusemann, ASBock, DSchroeter-Maas, SBeyer, DHeinemann, BMeyer, MSchierhorn, KZahlten, RWolff, GAydt, EM Rational design of novel, potent small molecule pan-selectin antagonists. J Med Chem 50:1101-15 (2007)  
Target
Name:
L-selectin
Synonyms:
LNHR LYAM1_HUMAN SELL | Selectin
Type:
PROTEIN
Mol. Mass.:
42187.20
Organism:
Homo sapiens (Human)
Description:
ChEMBL_200000
Residue:
372
  
Inhibitor
Name:
BDBM50205375
Synonyms:
CHEMBL220419 | {3-[3-(3,4,5-trihydroxy-phenyl)-propionylamino]-phenyl}-acetic acid
Type:
Small organic molecule
Emp. Form.:
C17H17NO6
Mol. Mass.:
331.32
SMILES:
OC(=O)Cc1cccc(NC(=O)CCc2cc(O)c(O)c(O)c2)c1
: